سیستم هشداردهی اولیه
alternative label: سیستم اعلام خطر اولیه
scope note: سیستم هشدار زودتر از موعد فاجعه یا بحران. هشدار به موقع شامل مراحل: مشاهده، برخورد، تجزیه و تحلیل، انتشار و واکنش است.
related: سیستم هشداردهی سیل
broader: سیستم هشداردهی
preferred label: Early warning system @en
type: Concept

سیستم هشداردهی
preferred label: Warning system @en
type: Concept
narrower: سیستم هشداردهی اولیه

سیستم هشداردهی سیل
preferred label: Flood warning system @en
type: Concept
related: سیستم هشداردهی اولیه