فوران آتشفشانی
scope note: خروج مواد مذاب در اتشفشان با فشار زیاد و جوشیدن گازهای درون آن.
related: آتشفشان
broader: سیستم هشداردهی
preferred label: Volcanic eruption @en
type: Concept

آتشفشان
preferred label: Volcano @en
type: Concept
related: فوران آتشفشانی

سیستم هشداردهی
preferred label: Warning system @en
type: Concept
narrower: فوران آتشفشانی