Electronic mail
preferred label: پست الکترونیکی @fa
type: Concept
related: Electronic mail system

Electronic mail system
alternative label: Email system
scope note: سیستم ارائه خدمات پست الکترونیکی و آمایش و پردازش متون و اطلاعات و ارتباطات و برنامه‌های مربوطه رایانه‌ای. @fa
related: Electronic mail
preferred label: سیستم پست الکترونیکی @fa
type: Concept