تابش غیریون‌ساز
preferred label: Non ionizing radiation @en
type: Concept
related: تابش یون‌ساز

کشتی هسته‌ای
preferred label: Nuclear powered ship @en
type: Concept
broader: تابش یون‌ساز

تابش یون‌ساز
alternative label: تابش یونی‌کننده
scope note: هر تابش با انرژی زیاد که موجب باردارشدن اتم‌ها و مولکول‌ها می‌شود. تابش‌هایی مثل ایکس که باعث می‌شود اتم‌ها، الکترون‌ها را آزاد کرده و یون شوند. نوعی پرتوتابی که الکترون‌های استخراج شده از بافت عبور می‌کنند. مثلاً اشعه ایکس، اشعه گاما، نوترون‌ها و اجزای آلفا یا بتا جزء اشعه یون‌‌ساز شمرده می‌شوند. قرار گرفتن در معرض تابش یون‌ساز ممکن است احتمال ابتلا به سرطان را بالا برد و همچنین با ایجاد جهش‌های ژنی باعث ناهنجاری‌هایی در نسل‌های آینده شود.
scope note: Radiation (including alpha particles) capable of causing ionisation of the matter through which it passes and hence damage to living tissue. @en
narrower: تابش هسته‌ای
narrower: کشتی هسته‌ای
type: Concept
preferred label: Ionizing radiation @en
related: تابش غیریون‌ساز

تابش هسته‌ای
preferred label: Nuclear radiation @en
type: Concept
broader: تابش یون‌ساز