سیاست پزشکی
scope note: خط‌ مشی‌ها و تصمیماتی که توسط سیاستگذاران دولتی، مسئولان، پزشکان یا شوراهای پزشکی برای تعیین و مشخص کردن اولویت‌ها یا هدف‌های حال و آینده پزشکی، درمان و مراقبت بهداشتی اتخاذ می‌شود.
related: پزشکی
preferred label: Medical policy @en
type: Concept

پزشکی
preferred label: Medicine @en
type: Concept
related: سیاست پزشکی