Disease surveillance
scope note: Health systems used to monitor, observe and evaluate on a continuing basis the progress of disease with the view to preventing of curing it.
scope note: سیستم بهداشتی مورد استفاده برای پایش، مشاهده و ارزیابی سیر بیماری به قصد متوقف ساختن سیر بیماری و یا درمان آن. @fa
related: Disease
preferred label: نظارت بر بیماری @fa
type: Concept

Disease
preferred label: بیماری @fa
type: Concept
related: Disease surveillance