Spontaneous combustion
scope note: (a) The process of increase in temperature of a material to a point of ignition without drawing heat from its surroundings (b) A biological or chemical reaction which produces heating to point of ignition resulting in combustion.
scope note: نوعی سوختن بدون منبع افروزش خارجی، مثل فرایند افزایش دمای یک ماده و رسیدن به یک نقطه افروزش. @fa
broader: Combustion
preferred label: سوختن خودبه‌خود @fa
type: Concept

Combustion
preferred label: سوختن @fa
type: Concept
narrower: Spontaneous combustion