سرریز
preferred label: Spill @en
type: Concept
related: نشت

نشت
scope note: در جریان زیرزمینی، ورود آب به داخل یک لایه آبدار از لایه نیمه نفوذپذیر فوقانی یا خروج از آن به داخل نیمه نفوذپذیر تحتانی.
related: سرریز
preferred label: Leakage @en
type: Concept