پهنه‌بندی
alternative label: زونش
scope note: دسته‌بندی یا متمایز ساختن نواحی زمین بر اساس موارد مورد نظر (مثل اقلیم، لرزه‌‌خیزی، جانوری، گیاهی) که آنها را از نواحی پیرامون متمایز می‌سازد.
narrower: پهنه لرزه‌ای
related: تجزیه و تحلیل خطر زلزله
preferred label: Zonation @en
type: Concept

پهنه لرزه‌ای
preferred label: Seismic zone @en
type: Concept
broader: پهنه‌بندی

تجزیه و تحلیل خطر زلزله
preferred label: Earthquake hazard analysis @en
type: Concept
related: پهنه‌بندی