Response
preferred label: واکنش (در مقابل بحران و فاجعه) @fa
type: Concept
related: Fire cover

Fire cover
scope note: The standards of response to a fire in a particular area. "Standards of Fire Cover".
scope note: استاندارد واکنش به آتش‌سوزی در یک منطقه خاص. @fa
related: Response
preferred label: پوشش منطقه‌ای آتش‌سوزی @fa
type: Concept