خطر پنبه نسوز
preferred label: Asbestos hazard @en
type: Concept
related: پنبه نسوز

سرطانزا
preferred label: Carcinogen @en
type: Concept
related: پنبه نسوز

پنبه نسوز
alternative label: آزبست
scope note: A group of fibrous metamorphic minerals of the hydrous magnesium silicate variety. It is used for its resistance to fire or heat, the fibers are often mixed with cement or woven into fabric or mats. @en
scope note: گروهی از کانی‌های رشته‌ای دگردیسی شده مربوط به ترکیب سیلیکات و منیزیم محتوی آب. از آن به علت مقاوم بودنش در برابر آتش و گرما استفاده می‌شود.
related: خطر پنبه نسوز
related: سرطانزا
preferred label: Asbestos @en
type: Concept