Riot
preferred label: آشوب @fa
type: Concept
broader: Civil disorder

Civil disorder
scope note: A riot, violent protest, demonstration or illegal assembly that may affect public safety.
scope note: شورش، اعتصاب شدید، تجمع آشکار یا غیرقانونی که موجب آسیب امنیت عمومی گردد. @fa
narrower: Riot
preferred label: ناآرامی داخلی @fa
type: Concept