Morbidity Rate
scope note: For a given diseases, the ratio of individuals having that diseases to the total number of the population.
scope note: نسبت تعداد بیماران به اشخاص سالم در یک جمعیت معین. @fa
related: Death
related: Disease
broader: Morbidity
preferred label: نرخ بیماری @fa
type: Concept

Death
preferred label: مرگ @fa
type: Concept
related: Morbidity Rate

Disease
preferred label: بیماری @fa
type: Concept
related: Morbidity Rate

Morbidity
preferred label: میزان بیماری @fa
type: Concept
narrower: Morbidity Rate