نرخ بیماری
preferred label: Morbidity Rate @en
type: Concept
broader: میزان بیماری

بیماری
preferred label: Disease @en
type: Concept
related: میزان بیماری

میزان بیماری
alternative label: ابتلا
scope note: The number of sick persons or of diseases in a given period among a given population. @en
scope note: نسبت تعداد بیماران به اشخاص سالم در یک جمعیت معین.
narrower: نرخ بیماری
related: بیماری
preferred label: Morbidity @en
type: Concept