سردخانه اجساد
alternative label: مرده‌خانه
scope note: محل نگهداری اجساد مجهول‌الهویه و محلی که درآن مرده را برای انجام مراسم تدفین یا سوزاندن آماده می کنند.
related: جسد
preferred label: Mortuary @en
type: Concept

جسد
preferred label: Cadaver @en
type: Concept
related: سردخانه اجساد