Levee
preferred label: خاکریز سیل‌بند @fa
type: Concept
related: Boom

Spillage control
preferred label: کنترل سرریزی @fa
type: Concept
related: Boom

Boom
scope note: Floating mechanical devices designed to control or divert oil.
scope note: ابزار مکانیکی سیال که برای کنترل یا انتقال نفت طراحی شوند. یا مانع موقتی شناور که در آب می‌اندازند تا ماده‌ای مثل لکۀ نفتی را محصور کند. @fa
related: Spillage control
related: Levee
preferred label: سد شناور @fa
type: Concept