Weir
preferred label: آب‌بند (سرریزشونده) @fa
type: Concept
related: Barrage

Barrage
scope note: Barriers across a stream provided with a series of gates or other control mechanisms to control the water surface level upstream, to regulate the flow or to divert water supplies into a canal.
scope note: مانع مجهز به دریچه یا تجهیزات دیگر کنترل که درمقطعی از بستر نهر به منظور تنظیم ارتفاع سطح آب در بالادست، ذخیره آب‌های طبیعی و انحراف آب در کانالها ایجاد می‌شود. @fa
related: Weir
related: Dam
preferred label: سد دریچه‌دار @fa
type: Concept

Dam
preferred label: سد @fa
type: Concept
related: Barrage