Functional area
scope note: The categorisation of services required for emergency relief for the purpose of allocating. These are catering, community organisations, emergency accommodation, emergency grant, counselling and temporary accommodation, material needs, registration.
scope note: رده‌بندی خدمات مورد نیاز برای امداد اضطراری با هدف مشخص کردن مسئولیت سازمان‌های منصوب شده. این خدمات عبارتند از تهیه آذوقه، سازماندهی مردم، محل سکونت اضطراری، کمک‌های بلاعوض اضطراری، مشاوره و محل سکونت موقتی، نیازهای مادی و ثبت. @fa
related: Emergency response
preferred label: منطقه کارکردی @fa
type: Concept

Emergency response
preferred label: واکنش در وضع اضطراری @fa
type: Concept
related: Functional area