Nominated agency
scope note: Agencies or organisations responsible for a functional area during emergency relief.
scope note: سازمان‌هایی که برای امداد اضطراری منصوب می‌شوند. @fa
related: Disaster relief
preferred label: سازمان انتصابی @fa
type: Concept

Disaster relief
preferred label: امداد به فاجعه‌دیدگان @fa
type: Concept
related: Nominated agency