سازمان
preferred label: Organization @en
type: Concept
narrower: مؤسسه

مؤسسه
scope note: تجمعی از افراد که از نظر قانون دارای شخصیت حقوقی بوده و به صورت دولتی یا خصوصی در زمینه خاصی مثل سرمایه‌گذاری، فرهنگی، پزشکی، حمل‌ونقل فعالیت می‌کند.
narrower: مؤسسه مالی
broader: سازمان
preferred label: Institution @en
type: Concept

مؤسسه مالی
preferred label: Financial institution @en
type: Concept
broader: مؤسسه