Zone management
preferred label: مدیریت منطقه @fa
type: Concept
related: Control area

Control area
scope note: Declared areas in an exotic animal disease emergency in which defined conditions apply to the movement into, out of, and within specific animals or things.
scope note: منطقه‌ای که در آن به علت بیماری‌های غیربومی حیوانی و فوریتی وضع اضطراری اعلام شده و از این رو در آنجا شرایط معینی برای جابه‌جایی حیوانات یا اشیاء مورد عمل است. @fa
related: Zone management
related: Exclusion area
broader: Zone
preferred label: منطقه تحت کنترل @fa
type: Concept

Zone
preferred label: منطقه @fa
type: Concept
narrower: Control area

Exclusion area
preferred label: منطقه ممنوعه @fa
type: Concept
related: Control area