مدیریت منطقه ساحلی
alternative label: مدیریت نواحی ساحلی
scope note: مدیریت مناطق ساحلی که از جمله شامل جلوگیری از تخریب ساحل، حفاظت و توسعه ساحل است.
related: ساحل
broader: منطقه ساحلی
preferred label: Coastal zone management @en
type: Concept

ساحل
preferred label: Coast @en
type: Concept
related: مدیریت منطقه ساحلی

منطقه ساحلی
preferred label: Coastal zone @en
type: Concept
narrower: مدیریت منطقه ساحلی