Clean up
scope note: Process of restoring a hazardous waste site or spill.
scope note: فرایند بازسازی و پاکسازی محل پسماند‌های خطرناک یا از بین بردن آنها. @fa
related: Hazardous waste
preferred label: پاکسازی (پسماند خطرناک) @fa
type: Concept

Hazardous waste
preferred label: پسماند‌ خطرناک @fa
type: Concept
related: Clean up