اختیار
preferred label: Authority @en
type: Concept
related: تفویض اختیار

مدیریت امور کارکنان
preferred label: Personnel management @en
type: Concept
narrower: تفویض اختیار

تفویض اختیار
scope note: انتقال یا واگذاری مسئولیت تصمیم‌گیری به مقامات تابعه یا فرایند و واگذاری کارها به دیگر افراد.
related: اختیار
broader: مدیریت امور کارکنان
preferred label: Delegation of authority @en
type: Concept