ارزیابی عملکرد
preferred label: Performance assessment @en
type: Concept
related: مقیاس عملکرد

مدیریت امور کارکنان
preferred label: Personnel management @en
type: Concept
narrower: مقیاس عملکرد

مقیاس عملکرد
alternative label: معیار انجام کار
scope note: مقیاسی است برای انجام کارکرد و یا برای ارزیابی طرحهای مختلف در عملیات یک سیستم.
related: ارزیابی عملکرد
broader: مدیریت امور کارکنان
preferred label: Performance measure @en
type: Concept