Endemic disease
scope note: The usual presence or prevalence of a disease in a given geographical area.
scope note: وقوع یا شیوع عادی یک بیماری در مناطق جغرافیایی خاص یا بیماریی که کم و بیش در یک محل وجود داشته باشد. @fa
related: Disease
preferred label: بیماری بومی @fa
type: Concept

Disease
preferred label: بیماری @fa
type: Concept
related: Endemic disease