منطقه‌بندی
scope note: در نقشه‌برداری و کاربری زمین، اختصاص دادن یک منطقه به فعالیت خاصی را گویند. مثلاً ناحیه صنعتی، منطقه مسکونی.
broader: منطقه‌بندی کاربری زمین
preferred label: Zoning @en
type: Concept

منطقه‌بندی کاربری زمین
preferred label: Land use zoning @en
type: Concept
narrower: منطقه‌بندی