مدت
preferred label: Duration @en
type: Concept
narrower: ساعت (شصت دقیقه)

ساعت (شصت دقیقه)
scope note: مدت زمانی که طی آن پانزده درجه از طول جغرافیایی در روی کرۀ زمین از جلوی تابش خورشید عبور می‌کند و برابر شصت دقیقه است.
broader: مدت
preferred label: Hour @en
type: Concept