مدت
preferred label: Duration @en
type: Concept
narrower: سال

سال
scope note: مدت زمانی که طول می‌کشد تا زمین یکبار گردش انتقالی خود را به دور خورشید انجام دهد.
broader: مدت
preferred label: Year @en
type: Concept