مدت
preferred label: Duration @en
type: Concept
narrower: ماه (جزء فصل)

ماه (جزء فصل)
scope note: یک ماه از سال. در ماه‌های شمسی یا خورشیدی، شش ماه اول سال هریک 31 روز و پنج ماه بعد، هریک 30 روز و ماه آخر یعنی اسفند 29 روز و هر چهار سال یکبار ماه آخر را 30 روز محسوب می‌دارند.
broader: مدت
preferred label: Month @en
type: Concept