زخم و آسیب
preferred label: Wound and injury @en
type: Concept
narrower: آسیب انفجار

آسیب انفجار
scope note: آسیب ناشی از امواج پرفشار هوا که به علت انفجار بمب‌ها و سایر انفجارهای شدید ایجاد می‌شود. این امواج موجب ضربه به ریه و خونریزی از آن می‌شود و نیز می‌تواند احشای شکم را له کرده و روی اعصاب اثر گذارد و پردۀ گوش را پاره کند.
broader: زخم و آسیب
preferred label: Blast injury @en
type: Concept