آسیب تابش
alternative label: بیماری تشعشع
scope note: آسیب ناشی از تابش ایکس یا گاما یا سایر اشکال خطرناک تابشی است.
related: تابش
broader: زخم و آسیب
preferred label: Radiation injury @en
type: Concept

تابش
preferred label: Radiation @en
type: Concept
related: آسیب تابش

زخم و آسیب
preferred label: Wound and injury @en
type: Concept
narrower: آسیب تابش