Crush syndrome
scope note: Shock state after crush injury usually accompanied by kidney injury.
scope note: عارضه ناشی از له شدن بافت‌های نرم بدن به‌ویژه در کلیه و اندام‌های تحتانی در اثر حوادثی مثل بمباران یا زیر آوار ماندن. @fa
broader: Crush injury
preferred label: سندرم له‌شدگی @fa
type: Concept

Crush injury
preferred label: آسیب له‌شدگی @fa
type: Concept
narrower: Crush syndrome