سندرم له‌شدگی
preferred label: Crush syndrome @en
type: Concept
broader: آسیب له‌شدگی

زخم و آسیب
preferred label: Wound and injury @en
type: Concept
narrower: آسیب له‌شدگی

آسیب له‌شدگی
scope note: قرارگرفتن بخشی از بدن، تحت درجه بالایی از فشار یا نیرو، به‌ویژه وقتی که بین اشیای سنگین یا غیر متحرک قرار گیرد و له شود.
narrower: سندرم له‌شدگی
broader: زخم و آسیب
preferred label: Crush injury @en
type: Concept