سوختگی (شیمیایی و گرمایی)
preferred label: Burn and scald @en
type: Concept
narrower: سوختگی گرمایی

سوختگی گرمایی
scope note: سوختگی در اثر حرارت زیاد یا خورشید. اگر مصدوم دچار سوختگی با شعله‌های آتش باشد، دود و هوای داغ، دستگاه تنفسی را دچار آسیب‌دیدگی می‌سازد. در فردی که دچار سوختگی شدید شده باشد ممکن است شوک نیز روی دهد که در این صورت به عملیات باززنده‌سازی نیاز است.
broader: سوختگی (شیمیایی و گرمایی)
preferred label: Thermal burn @en
type: Concept