مشاوره غم
scope note: نوع خاصی از روان‌درمانی کوتاه مدت برای از بین بردن یا تخفیف غم و اندوه.
related: داغدیدگی
preferred label: Grief counselling @en
type: Concept

داغدیدگی
preferred label: Bereavement @en
type: Concept
related: مشاوره غم