آشکارساز
preferred label: Detector @en
type: Concept
related: زبانه

زبانه
alternative label: تنوره
scope note: (a) Columns of non-combustible products emitted from a fire (smoke) (b) Vapor cloud formations having shape and buoyancy (c) The airborne radioactive materials released from a nuclear power plant and carried by the prevailing winds which may effect radiologically those downwind areas over which passes. @en
scope note: ستونهایی از دود آتش و یا انبوه چرخندی گرد و غبار، که قطرش معمولاً از چند متر تجاوز نمی‌کند و در آن ذرات گرداگرد مرکز چرخانیده و به ارتفاع زیاد بالا برده می‌شوند.
related: آشکارساز
preferred label: Plume @en
type: Concept