مسئولیت حرفه‌ای
scope note: وضعیت پاسخگو بودن برای انجام تعهدات و وظایف حرفه‌ای وشغلی.
broader: مسئولیت
preferred label: Professional liability @en
type: Concept

مسئولیت
preferred label: Liability @en
type: Concept
narrower: مسئولیت حرفه‌ای