Death
preferred label: مرگ @fa
type: Concept
related: Mortality

Mortality
scope note: The number, magnitude or frequency of deaths over a period of time amount the total sick and well popluation of an area.
scope note: بررسی مرگ ‌و ‌میر، تأثیر این واقعه را بر جمعیت مورد مطالعه نشان می‌دهد. اگر اصطلاح مرگ‌ و ‌میر بدون هیچ توضیح دیگری به کار رود، منظور از آن، میزان ناویژۀ مرگ‌ و‌ میر یا میزان عمومی مرگ‌ و‌ میر است. این میزان برای دورۀ زمانی یکساله محاسبه می‌شود و عبارت است از نسبت تعداد مرگ‌ها در طول یکسال به تعداد کسانی که (کل جمعیت) در همان سال در معرض مرگ‌ و‌ میر قرار داشته‌‌اند. @fa
narrower: Mortality rate
related: Death
preferred label: مرگ و میر @fa
type: Concept

Mortality rate
preferred label: میزان مرگ و میر @fa
type: Concept
broader: Mortality