خودکشی
scope note: عمل خاتمه دادن عمدی به زندگی خود مشروط به اینکه به میل خود فرد و به دست خود او صورت گیرد. اینک خودکشی یکی از مسائل جدی روانی و اجتماعی است. دکتر اروین استنگل روان‌شناس فقید انگلیسی و پژوهشگر موضوع خودکشی، گناه خودکشی را به گردن اوضاع و احوال اجتماعی می‌اندازد و می‌گوید روابط اجتماعی بین انسان‌ها فوق‌العاده بد و مأیوس‌کننده شده است، چرا که اجتماع ما تنها به رقابت‌های ناسالم و افراد زرنگ که قدرت زد و بند دارند میدان می‌دهد و بقیه را که اکثراً مردمی عادی و صاف و ساده‌اند در جزر و مدّ حوادث و خشونتهای جامعه خرد و مأیوس می‌کند. همین اکثریت، خود را افراد ناموفق تشخیص داده و دچار احساس تنهایی، افسردگی و گاهی نفرت و کینه می‌شوند که نتیجه‌اش خودکشی است.
broader: مرگ
preferred label: Suicide @en
type: Concept

مرگ
preferred label: Death @en
type: Concept
narrower: خودکشی