رفتار انسانی
preferred label: Human behavior @en
type: Concept
related: روان‌پزشکی

روان‌درمانی
preferred label: Psychotherapy @en
type: Concept
related: روان‌پزشکی

روان‌پزشکی
scope note: رشته‌ای اصلی از دانش پزشکی که به تشخیص، پیشگیری و درمان بیماری‌های روانی می‌پردازد.
related: روان‌درمانی
related: رفتار انسانی
preferred label: Psychiatry @en
type: Concept