جایگاه دفع پسماند
preferred label: Waste disposal site @en
type: Concept
related: دفن زباله

دفن زباله
alternative label: دفع زباله
scope note: تخلیه زباله در گودی‌ها، زمین‌های پست طبیعت، دره‌ها و نواحی باتلاقی یا زمین‌های همواری که بخواهند در آنها عوارض مصنوعی ایجاد کنند و پوشاندن آن با خاک.
related: جایگاه دفع پسماند
preferred label: Landfill @en
type: Concept