Gale
scope note: Winds with a speed between 34 and 40 knots.
scope note: باد شدیدی است که در مقیاس بوفور به بیش از 8 می‌رسد. مثل باد تند با سرعت نزدیک به 70 کیلومتر در ساعت در سطح زمین. @fa
related: Storm
broader: Wind
preferred label: تندباد @fa
type: Concept

Wind
preferred label: باد @fa
type: Concept
narrower: Gale

Storm
preferred label: توفان @fa
type: Concept
related: Gale