Flood mitigation
preferred label: تقلیل اثرات سیل @fa
type: Concept
related: Floodplain zoning

Floodplain
preferred label: دشت سیلابی @fa
type: Concept
narrower: Floodplain zoning

Floodplain zoning
scope note: A plan that defines the main zones of a potential food area.
scope note: برنامه‌ای که مناطق اصلی دارای قابلیت وقوع سیل را معرفی می‌کند. @fa
related: Flood mitigation
broader: Floodplain
preferred label: منطقه‌بندی دشت سیلابی @fa
type: Concept