Combustible material
preferred label: ماده سوختنی @fa
type: Concept
narrower: Combustible liquid

Combustible liquid
scope note: Liquids having a flash point and which are not flammable liquids.
scope note: مایع دارای قدرت شعله‌ور شدن و مایعی که آتش‌زا نیست. @fa
related: Flammable liquid
broader: Combustible material
preferred label: مایع سوختنی @fa
type: Concept

Flammable liquid
preferred label: مایع اشتعال‌پذیر @fa
type: Concept
related: Combustible liquid