Emergency service personnel
preferred label: کارکنان سازمان خدمات اضطراری @fa
type: Concept
narrower: Fire fighter

Fire fighter
scope note: People whose activity or employment is to extinguish fires; members of fire services.
narrower: Bush fire fighter
broader: Emergency service personnel
preferred label: آتش‌نشان @fa
type: Concept

Bush fire fighter
preferred label: آتش‌نشان بیشه @fa
type: Concept
broader: Fire fighter