Vulnerability analysis
preferred label: تجزیه و تحلیل آسیب‌پذیری @fa
type: Concept
broader: Vulnerability

Vulnerability assessment
preferred label: ارزیابی آسیب‌پذیری @fa
type: Concept
broader: Vulnerability

Vulnerability reduction
preferred label: کاهش آسیب‌پذیری @fa
type: Concept
broader: Vulnerability

Disaster vulnerability
preferred label: آسیب‌پذیری از فاجعه @fa
type: Concept
broader: Vulnerability

Vulnerability
type: Concept
narrower: Vulnerability reduction
narrower: Disaster vulnerability
narrower: Vulnerability assessment
narrower: Vulnerability analysis
preferred label: آسیب‌پذیری @fa
scope note: هر عامل کالبدی، ساختاری یا اجتماعی و اقتصادی که در برابر یک عامل خطرآفرین امکان دارد خسارت ببیند، ویران شود و یا نابود گردد. یا میزان حساسیت یک جامعه در مقابل حوادث و وقایع از یک طرف و بزرگی اندازه ضایعات و خسارت‌ها در زمان وقوع از طرف دیگر. علت‌های آسیب‌پذیری جوامع را می‌توان به شرح زیر خلاصه کرد: 1- علت‌های زمینه‌ای مثل فقر، عدم دستیابی به منابع، اختلافات قومی و ایدئولوژیک و فرهنگی و دینی، نظام اقتصادی و اجتماعی. 2- فشارهای محرک مثل کمبود سازمان‌های محلی و غیردولتی، عدم مهارت زندگی، ازدیاد جمعیت، توسعه بی‌رویه شهری، تخریب محیط زیست. 3- شرایط غیر ایمن مثل کاربری نادرست زمین، احداث ساختمان‌های خطرناک، مشکلات سیاسی و ناامنی. @fa
scope note: The degree of susceptibility of the environment to a hazard.