بزرگسال جوان
alternative label: جوان
scope note: شخصی که در سال‌های اولیه بلوغ یا بزرگسالی قرار دارد.
broader: بزرگسال
preferred label: Young adult @en
type: Concept

بزرگسال
preferred label: Adult @en
type: Concept
narrower: بزرگسال جوان