انفجار ضربه‌ای
preferred label: Detonation @en
type: Concept
related: گرگرفتن

انفجار
preferred label: Explosion @en
type: Concept
related: گرگرفتن

گرگرفتن
alternative label: افروزش سریع
scope note: The chemical oxidation reaction (burning)of hydrocarbon material in which the reaction front advances info the unreacted material at less than sonic velocity. @en
scope note: نوعی واکنش شیمیایی که با آزاد شدن شدید گرما، شعله، جرقه یا پخش ذرات در حال سوختن همراه است.
related: انفجار ضربه‌ای
related: انفجار
preferred label: Deflagration @en
type: Concept