Rockfall
scope note: Free-falling or precipitous movement of a newly detached segment of bedrock of any size from a cliff or other very steep slope.
broader: Landslide
preferred label: سقوط سنگ @fa
type: Concept

Landslide
preferred label: زمین‌لغزه @fa
type: Concept
narrower: Rockfall